{"text_format":"1","workbook":"xlsx","n_sheets":5,"sheets":["CC X-sell Paramenters","CC X-sell","Macros","Postcode Lookup Tool","Definitions"],"not_rendered":{"charts":0,"images":1,"macros":1,"external_links":2,"defined_names":580,"comments":0,"pivot_tables":0},"unopened":[],"bounds":{"document_bytes":16777216,"sheet_cells":100000,"rows_first":2000,"rows_last":500,"rows_between":2000,"halvings":0,"cell_chars":16384,"cell_head_chars":4096},"cells_cut":0,"cells_raw":0,"read":"whole","date_system":"1900"}

{"sheet":"CC X-sell Paramenters","index":0,"n_rows":105,"n_cols":14,"rows_kept":105,"cut":false,"hidden":true,"merged":[[55,9,55,10],[60,9,60,10],[56,9,56,10],[57,9,57,10],[58,9,58,10],[59,9,59,10],[54,9,54,10],[43,9,43,10],[44,9,44,10],[45,9,45,10],[46,9,46,10],[47,9,47,10],[48,9,48,10],[49,9,49,10],[50,9,50,10],[51,9,51,10],[52,9,52,10],[53,9,53,10],[42,9,42,10],[31,9,31,10],[32,9,32,10],[33,9,33,10],[34,9,34,10],[35,9,35,10],[36,9,36,10],[37,9,37,10],[38,9,38,10],[39,9,39,10],[40,9,40,10],[41,9,41,10]]}
["Marital Status","Income 1","Income2","Surplus","Surplus #","Code","Card Value Applicant 1","Card Value Applicant 2",null,"Marital status","Income1","Income2","surplus","Code"]
["S",">0","<=0",-99999999,1,"SPN1",0,0,null,{"$f":"IF(#REF!=\"\",\"S\",\"J\")","v":{"$error":"#REF!"}},{"$f":"IF(#REF!>0,\"P\",\"N\")","v":{"$error":"#REF!"}},{"$f":"IF(#REF!>0,\"P\",\"N\")","v":{"$error":"#REF!"}},{"$f":"VLOOKUP(#REF!,'CC X-sell Paramenters'!D2:E16,2)","v":{"$error":"#REF!"}},{"$f":"CONCATENATE(J2,K2,L2,M2)","v":{"$error":"#REF!"}}]
["S",">0","<=0",38,2,"SPN2",1000,0]
["S",">0","<=0",76,3,"SPN3",2000,0]
["S",">0","<=0",114,4,"SPN4",3000,0]
["S",">0","<=0",152,5,"SPN5",4000,0]
["S",">0","<=0",190,6,"SPN6",5000,0]
["S",">0","<=0",228,7,"SPN7",6000,0]
["S",">0","<=0",266,8,"SPN8",7000,0]
["S",">0","<=0",304,9,"SPN9",8000,0]
["S",">0","<=0",342,10,"SPN10",9000,0]
["S",">0","<=0",380,11,"SPN11",10000,0]
["S",">0","<=0",456,12,"SPN12",12000,0]
["S",">0","<=0",570,13,"SPN13",15000,0]
["S",">0","<=0",760,14,"SPN14",20000,0]
["S",">0","<=0",950,15,"SPN15",25000,0]
["S","<=0","<=0",-99999999,1,"SNN1",0,0]
["S","<=0","<=0",38,2,"SNN2",0,0]
["S","<=0","<=0",76,3,"SNN3",0,0]
["S","<=0","<=0",114,4,"SNN4",0,0]
["S","<=0","<=0",152,5,"SNN5",0,0]
["S","<=0","<=0",190,6,"SNN6",0,0]
["S","<=0","<=0",228,7,"SNN7",0,0]
["S","<=0","<=0",266,8,"SNN8",0,0]
["S","<=0","<=0",304,9,"SNN9",0,0]
["S","<=0","<=0",342,10,"SNN10",0,0]
["S","<=0","<=0",380,11,"SNN11",0,0]
["S","<=0","<=0",456,12,"SNN12",0,0]
["S","<=0","<=0",570,13,"SNN13",0,0]
["S","<=0","<=0",760,14,"SNN14",0,0]
["S","<=0","<=0",950,15,"SNN15",0,0]
["J",">0","<=0",-99999999,1,"JPN1",0,0]
["J",">0","<=0",38,2,"JPN2",1000,0]
["J",">0","<=0",76,3,"JPN3",2000,0]
["J",">0","<=0",114,4,"JPN4",3000,0]
["J",">0","<=0",152,5,"JPN5",4000,0]
["J",">0","<=0",190,6,"JPN6",5000,0]
["J",">0","<=0",228,7,"JPN7",6000,0]
["J",">0","<=0",266,8,"JPN8",7000,0]
["J",">0","<=0",304,9,"JPN9",8000,0]
["J",">0","<=0",342,10,"JPN10",9000,0]
["J",">0","<=0",380,11,"JPN11",10000,0]
["J",">0","<=0",456,12,"JPN12",12000,0]
["J",">0","<=0",570,13,"JPN13",15000,0]
["J",">0","<=0",760,14,"JPN14",20000,0]
["J",">0","<=0",950,15,"JPN15",25000,0]
["J","<=0","<=0",-99999999,1,"JNN1",0,0]
["J","<=0","<=0",38,2,"JNN2",0,0]
["J","<=0","<=0",76,3,"JNN3",0,0]
["J","<=0","<=0",114,4,"JNN4",0,0]
["J","<=0","<=0",152,5,"JNN5",0,0]
["J","<=0","<=0",190,6,"JNN6",0,0]
["J","<=0","<=0",228,7,"JNN7",0,0]
["J","<=0","<=0",266,8,"JNN8",0,0]
["J","<=0","<=0",304,9,"JNN9",0,0]
["J","<=0","<=0",342,10,"JNN10",0,0]
["J","<=0","<=0",380,11,"JNN11",0,0]
["J","<=0","<=0",456,12,"JNN12",0,0]
["J","<=0","<=0",570,13,"JNN13",0,0]
["J","<=0","<=0",760,14,"JNN14",0,0]
{"$rows_left_out":46}
{"sheet":"CC X-sell","index":1,"n_rows":358,"n_cols":10,"rows_kept":358,"cut":false,"hidden":true,"merged":[[27,1,27,2],[28,1,28,2],[29,1,29,2],[36,1,36,2],[32,1,32,2],[33,1,33,2],[35,1,35,2],[30,1,30,2],[31,1,31,2],[34,1,34,2],[68,1,68,2],[38,1,38,2],[41,1,41,2],[22,1,22,2],[24,1,24,2],[23,1,23,2],[25,1,25,2],[37,1,37,2],[67,1,67,2],[26,1,26,2],[66,1,66,2],[64,1,64,2],[65,1,65,2],[63,1,63,2],[61,1,61,2],[45,1,45,2],[46,1,46,2],[47,1,47,2],[48,1,48,2],[49,1,49,2],[52,1,52,2],[50,1,50,2],[51,1,51,2],[42,1,42,2],[43,1,43,2],[44,1,44,2],[40,1,40,2],[39,1,39,2],[54,1,54,2],[62,1,62,2],[53,1,53,2],[55,1,55,2],[56,1,56,2],[57,1,57,2],[58,1,58,2],[59,1,59,2],[60,1,60,2]]}
["Credit Card Fulfilment Rules - Requirement P1.16"]
[]
[]
["1. Eligibility Policy"]
[]
["App Type","Aust Resident","Busn, Trust or more than 2 applicants?","Home Plus Loan","New consent form?","Requested Limit <$500","App 1 Opt out","App 2 Opt out","Loan Approved","System Action"]
["Sole",null,null,null,null,null,"Y",null,null,"No Card"]
["Joint",null,null,null,null,null,"Y","Y",null,"No Card"]
["Any",null,"Y",null,null,null,null,null,null,"No Card"]
["Any",null,null,null,null,null,null,null,"N","No Card"]
["Any","N",null,"any","N/A",null,"N","N","Y","No Card"]
["Any",null,null,null,null,"Y",null,null,null,"No Card"]
["Any","Y",null,"N","N/A",null,"N/A","N/A","Y","Nil - card offer as per old process."]
["Any","Y",null,"Y","N",null,"N/A","N/A","Y","Nil - card offer as per old process."]
["Sole","Y","N","Y","Y",null,"N","N/A","Y","As per matrix rules for sole applicants"]
["Joint","Y","N","Y","Y",null,"N","N","Y","As per matrix rules for joint applicants"]
["Joint","Y","N","Y","Y",null,"Y","N ","Y","As per matrix rules for joint applicants"]
["Joint","Y","N","Y","Y",null,"N","Y","Y","As per matrix rules for joint applicants"]
[]
[]
["2. Clock Matrix"]
[]
["Type","Surplus (DT or DCA Override value provided)",null,"Income","System Action/Approval"]
["Any","any",null,0,"No Card"]
["Sole","<$25",null,">$0","No Card"]
["Sole","$25-$49",null,">$0",1000]
["Sole","$50-$74",null,">$0",2000]
["Sole","$75-$99",null,">$0",3000]
["Sole","$100-$124",null,">$0",4000]
["Sole","$125-$149",null,">$0",5000]
["Sole","$150-$174",null,">$0",6000]
["Sole","$175-$199",null,">$0",7000]
["Sole","$200-$224",null,">$0",8000]
["Sole","$225-$249",null,">$0",9000]
["Sole","$250-$299",null,">$0",10000]
["Sole","$300-$374",null,">$0",12000]
["Sole","$375-$499",null,">$0",15000]
["Sole","$500-$624",null,">$0",20000]
["Sole",">= $625",null,">$0",25000]
["Joint","<$25",null,"App 1 = >$0\nApp 2 =   $0","No Card"]
["Joint","$25-$49",null,"App 1 = >$0\nApp 2 =   $0","$1000 to applicant with income"]
["Joint","$50-$74",null,"App 1 = >$0\nApp 2 =   $0","$2000 to applicant with income"]
["Joint","$75-$99",null,"App 1 = >$0\nApp 2 =   $0","$3000 to applicant with income"]
["Joint","$100-$124",null,"App 1 = >$0\nApp 2 =   $0","$4000 to applicant with income"]
["Joint","$125-$149",null,"App 1 = >$0\nApp 2 =   $0","$5000 to applicant with income"]
["Joint","$150-$174",null,"App 1 = >$0\nApp 2 =   $0","$6000 to applicant with income"]
["Joint","$175-$199",null,"App 1 = >$0\nApp 2 =   $0","$7000 to applicant with income"]
["Joint","$200-$224",null,"App 1 = >$0\nApp 2 =   $0","$8000 to applicant with income"]
["Joint","$225-$249",null,"App 1 = >$0\nApp 2 =   $0","$9000 to applicant with income"]
["Joint","$250-$299",null,"App 1 = >$0\nApp 2 =   $0","$10000 to applicant with income"]
["Joint","$300-$374",null,"App 1 = >$0\nApp 2 =   $0","$12000 to applicant with income"]
["Joint","$375-$499",null,"App 1 = >$0\nApp 2 =   $0","$15000 to applicant with income"]
["Joint","$500-$624",null,"App 1 = >$0\nApp 2 =   $0","$20000 to applicant with income"]
["Joint",">= $625",null,"App 1 = >$0\nApp 2 =   $0","$25000 to applicant with income"]
["Joint","<$25",null,"App 1 = >$0\nApp 2 = >$0","No Card"]
["Joint","$25-$49",null,"App 1 = >$0\nApp 2 = >$0","$500 each"]
["Joint","$50-$74",null,"App 1 = >$0\nApp 2 = >$0","$1,000 each"]
["Joint","$75-$99",null,"App 1 = >$0\nApp 2 = >$0","$1,500 each"]
["Joint","$100-$124",null,"App 1 = >$0\nApp 2 = >$0","$2,000 each"]
["Joint","$125-$149",null,"App 1 = >$0\nApp 2 = >$0","$2,500 each"]
{"$rows_left_out":299}
{"sheet":"Macros","index":2,"n_rows":136,"n_cols":2,"rows_kept":136,"cut":false,"hidden":true,"merged":[]}
[null,"auto_open_Load()"]
[null,{"$f":"Initialise()","v":{"$error":"#N/A"}}]
[null,{"$f":"RETURN()","v":true}]
[]
[null,"Initialise()"]
[null,"STEP()"]
[null,{"$f":"ACTIVATE(\"Calculator\")","v":true}]
[null,{"$f":"CALCULATION(3)","v":true}]
[null,{"$f":"FORMULA(Loan_Term_Default,!Loan_Term)","v":true}]
[null,"FORMULA(HSL_Servicing_Rate/100,!Working_servicing_rate)"]
[null,{"$f":"FORMULA(\"\",!Additional_expenses)","v":true}]
[null,{"$f":"FORMULA(\"\",!borrowers)","v":true}]
[null,{"$f":"FORMULA(1,!provider_code)","v":true}]
[null,{"$f":"FORMULA(1,!loan_type_code)","v":true}]
[null,{"$f":"FORMULA(\"\",!loan_amount)","v":true}]
[null,{"$f":"FORMULA(\"\",!security_value)","v":true}]
[null,{"$f":"FORMULA(1,!number_of_adults)","v":true}]
[null,{"$f":"FORMULA(\"\",!number_of_dependants)","v":true}]
[null,{"$f":"FORMULA(\"\",!annual_income_1PAYG)","v":true}]
[null,{"$f":"FORMULA(\"\",!annual_income_1)","v":true}]
[null,{"$f":"FORMULA(\"\",!annual_income_2PAYG)","v":true}]
[null,{"$f":"FORMULA(\"\",!annual_income_2)","v":true}]
[null,{"$f":"FORMULA(\"\",!annual_income_3PAYG)","v":true}]
[null,{"$f":"FORMULA(\"\",!annual_income_3)","v":true}]
[null,{"$f":"FORMULA(\"\",!annual_income_4PAYG)","v":true}]
[null,{"$f":"FORMULA(\"\",!annual_income_4)","v":true}]
[null,{"$f":"FORMULA(\"\",!Annual_Income1_Rental)","v":true}]
[null,{"$f":"FORMULA(\"\",!Annual_Income2_Rental)","v":true}]
[null,{"$f":"FORMULA(\"\",!Annual_Income3_Rental)","v":true}]
[null,{"$f":"FORMULA(\"\",!Annual_Income4_Rental)","v":true}]
[null,{"$f":"FORMULA(\"\",!other_income_1)","v":true}]
[null,{"$f":"FORMULA(\"\",!other_income_2)","v":true}]
[null,{"$f":"FORMULA(\"\",!other_mortgages)","v":true}]
[null,{"$f":"FORMULA(\"\",!other_loan_commitments)","v":true}]
[null,{"$f":"FORMULA(\"\",!Total_other_loan_commitments)","v":true}]
[null,{"$f":"FORMULA(\"\",!rent_and_expenses)","v":true}]
[null,{"$f":"FORMULA(\"\",!total_mortgages)","v":true}]
[null,{"$f":"FORMULA(\"\",!credit_card_limit)","v":true}]
[null,{"$f":"FORMULA(\"\",!broker_name)","v":true}]
[null,{"$f":"FORMULA(\"\",!broker_id_number)","v":true}]
[null,{"$f":"FORMULA(\"\",!Oth_inv1)","v":true}]
[null,{"$f":"FORMULA(\"\",!Oth_inv2)","v":true}]
[null,{"$f":"FORMULA(\"\",!Oth_inv3)","v":true}]
[null,{"$f":"FORMULA(\"\",!Oth_inv4)","v":true}]
[null,{"$f":"FORMULA(\"\",!Borrowers2)","v":true}]
[null,{"$f":"FORMULA(\"\",!Borrowers3)","v":true}]
[null,{"$f":"FORMULA(\"\",!Borrowers4)","v":true}]
[null,{"$f":"FORMULA(1,!#REF!)","v":true}]
[null,{"$f":"FORMULA(1,!#REF!)","v":true}]
[null,{"$f":"FORMULA(1,!#REF!)","v":true}]
[null,{"$f":"FORMULA(1,!#REF!)","v":true}]
[null,{"$f":"FORMULA(1,!#REF!)","v":true}]
[null,{"$f":"FORMULA(1,!MARR1)","v":true}]
[null,{"$f":"FORMULA(1,!MARR2)","v":true}]
[null,{"$f":"FORMULA(1,!MARR3)","v":true}]
[null,{"$f":"FORMULA(1,!MARR4)","v":true}]
[null,{"$f":"FORMULA(1,!#REF!)","v":true}]
[null,{"$f":"FORMULA(1,!#REF!)","v":true}]
[null,{"$f":"FORMULA(1,!#REF!)","v":true}]
[null,{"$f":"FORMULA(1,!#REF!)","v":true}]
{"$rows_left_out":77}
{"sheet":"Postcode Lookup Tool","index":3,"n_rows":343,"n_cols":11,"rows_kept":343,"cut":false,"hidden":false,"merged":[]}
[]
[null,null,"Restricted and Inner City Postcodes"]
[]
[]
[]
[null,null,null,"<<< Enter full postcode and click search"]
[]
[]
[]
[]
[null,null,"POSTCODE","STATE","SUBURB","PROPERTY TYPE","LOAN\nPURPOSE","LOAN TYPE","POLICY","POLICY\nEXCLUSIONS","EFFECTIVE DATE"]
[null,null,800,"NT","Darwin City, Darwin","Apartment","Non Owner Occupied","All","For non-owner occupied apartments LMI is required where LVR is more than 70%","Not Applicable","2023-07-20"]
[null,null,800,"NT","Darwin City, Darwin","All","All","All","Maximum LVR = 80% (including LMI capitalisation)","DT Approved","2023-07-20"]
[null,null,820,"NT","Bayview, Charles Darwin, Coonawarra, East Point, Eaton, Fannie Bay, Larrakeyah, Ludmilla, Parap, Stuart Park","All","All","All","Maximum LVR = 80% (including LMI capitalisation)","DT Approved","2025-09-02"]
[null,null,2000,"NSW","Barangaroo, Dawes Point, Haymarket, Millers Point, Sydney, The Rocks","Apartment","Non Owner Occupied","All","Maximum LVR = 80% (including LMI capitalisation)","DT Approved","2025-09-02"]
[null,null,2000,"NSW","Sydney CBD","Apartment","Non Owner Occupied","All","For non-owner occupied apartments LMI is required where LVR is more than 70%","Not Applicable","2023-07-20"]
[null,null,2007,"NSW","Ultimo","Apartment","Non Owner Occupied","All","Maximum LVR = 80% (including LMI capitalisation)","DT Approved","2025-09-02"]
[null,null,2008,"NSW","Chippendale, Darlington","Apartment","Non Owner Occupied","All","Maximum LVR = 80% (including LMI capitalisation)","DT Approved","2025-09-02"]
[null,null,2017,"NSW","Waterloo, Zetland","Apartment","Non Owner Occupied","All","For non-owner occupied apartments LMI is required where LVR is more than 70%","Not Applicable","2023-07-20"]
[null,null,2017,"NSW","Waterloo, Zetland","Apartment","All","All","Maximum LVR = 80% (including LMI capitalisation)","DT Approved","2025-09-02"]
[null,null,2018,"NSW","Eastlakes, Rosebery","Apartment","All","All","Maximum LVR = 80% (including LMI capitalisation)","DT Approved","2023-07-20"]
[null,null,2019,"NSW","Banksmeadow, Botany","Apartment","All","All","Maximum LVR = 80% (including LMI capitalisation)","DT Approved","2018-07-14"]
[null,null,2020,"NSW","Mascot","Apartment","All","All","Maximum LVR = 80% (including LMI capitalisation)","DT Approved","2023-07-20"]
[null,null,2050,"NSW","Camperdown","Apartment","Non Owner Occupied","All","Maximum LVR = 80% (including LMI capitalisation)","DT Approved","2025-09-02"]
[null,null,2127,"NSW","Newington, Sydney Olympic Park, Wentworth Point","Apartment","Non Owner Occupied","All","Maximum LVR = 80% (including LMI capitalisation)","DT Approved","2023-07-20"]
[null,null,2128,"NSW","Silverwater","Apartment","Non Owner Occupied","All","Maximum LVR = 80% (including LMI capitalisation)","DT Approved","2023-07-20"]
[null,null,2131,"NSW","Ashfield","Apartment","All","All","Maximum LVR = 80% (including LMI capitalisation)","DT Approved","2025-09-02"]
[null,null,2134,"NSW","Burwood","Apartment","All","All","Maximum LVR = 80% (including LMI capitalisation)","DT Approved","2023-07-20"]
[null,null,2135,"NSW","Strathfield","Apartment","All","All","Maximum LVR = 80% (including LMI capitalisation)","DT Approved","2023-07-20"]
[null,null,2136,"NSW","Burwood Heights, Enfield, Strathfield South","Apartment","All","All","Maximum LVR = 80% (including LMI capitalisation)","DT Approved","2023-07-20"]
[null,null,2140,"NSW","Homebush, Homebush West","Apartment","All","All","Maximum LVR = 80% (including LMI capitalisation)","DT Approved","2018-07-14"]
[null,null,2141,"NSW","Berala, Lidcombe, Rookwood","Apartment","Non Owner Occupied","All","Maximum LVR = 80% (including LMI capitalisation)","DT Approved","2023-07-20"]
[null,null,2142,"NSW","Camellia, Clyde, Granville, Holroyd, Rosehill, South Granville","All","All","All","Maximum LVR = 80% (including LMI capitalisation)","DT Approved","2025-09-02"]
[null,null,2143,"NSW","Birrong, Potts Hill, Regents Park","Apartment","Non Owner Occupied","All","Maximum LVR = 80% (including LMI capitalisation)","DT Approved","2023-07-20"]
[null,null,2144,"NSW","Auburn","Apartment","Non Owner Occupied","All","Maximum LVR = 80% (including LMI capitalisation)","DT Approved","2023-07-20"]
[null,null,2150,"NSW","Harris Park, Parramatta","Apartment","All","All","Maximum LVR = 80% (including LMI capitalisation)","DT Approved","2018-07-14"]
[null,null,2160,"NSW","Merrylands, Merrylands West","All","All","All","Maximum LVR = 80% (including LMI capitalisation)","DT Approved","2025-09-02"]
[null,null,2161,"NSW","Guildford, Guildford West, Old Guildford, Yennora","All","All","All","Maximum LVR = 80% (including LMI capitalisation)","DT Approved","2025-09-02"]
[null,null,2162,"NSW","Chester Hill, Sefton","All","All","All","Maximum LVR = 80% (including LMI capitalisation)","DT Approved","2025-09-02"]
[null,null,2164,"NSW","Smithfield, Wetherill Park, Woodpark","All","All","All","Maximum LVR = 80% (including LMI capitalisation)","DT Approved","2025-09-02"]
[null,null,2165,"NSW","Fairfield, Fairfield East, Fairfield Heights, Fairfield West","All","All","All","Maximum LVR = 80% (including LMI capitalisation)","DT Approved","2025-09-02"]
[null,null,2190,"NSW","Chullora, Greenacre","Apartment","All","All","Maximum LVR = 80% (including LMI capitalisation)","DT Approved","2025-09-02"]
[null,null,2191,"NSW","Belfield","Apartment","All","All","Maximum LVR = 80% (including LMI capitalisation)","DT Approved","2025-09-02"]
[null,null,2192,"NSW","Belmore","Apartment","All","All","Maximum LVR = 80% (including LMI capitalisation)","DT Approved","2025-09-02"]
[null,null,2193,"NSW","Ashbury, Canterbury, Hurlstone Park","Apartment","All","All","Maximum LVR = 80% (including LMI capitalisation)","DT Approved","2023-07-20"]
[null,null,2194,"NSW","Campsie","Apartment","All","All","Maximum LVR = 80% (including LMI capitalisation)","DT Approved","2023-07-20"]
[null,null,2195,"NSW","Lakemba, Wiley Park","Apartment","All","All","Maximum LVR = 80% (including LMI capitalisation)","DT Approved","2018-07-14"]
[null,null,2196,"NSW","Punchbowl, Roselands","Apartment","All","All","Maximum LVR = 80% (including LMI capitalisation)","DT Approved","2025-09-02"]
[null,null,2197,"NSW","Bass Hill","All","All","All","Maximum LVR = 80% (including LMI capitalisation)","DT Approved","2023-07-20"]
[null,null,2198,"NSW","Georges Hall","All","All","All","Maximum LVR = 80% (including LMI capitalisation)","DT Approved","2023-07-20"]
[null,null,2199,"NSW","Yagoona","Apartment","Non Owner Occupied","All","Maximum LVR = 80% (including LMI capitalisation)","DT Approved","2025-09-02"]
[null,null,2200,"NSW","Bankstown, Bankstown Aerodrome, Condell Park, Mount Lewis","Apartment","All","All","Maximum LVR = 80% (including LMI capitalisation)","DT Approved","2025-09-02"]
[null,null,2205,"NSW","Arncliffe, Turrella, Wolli Creek","Apartment","All","All","Maximum LVR = 80% (including LMI capitalisation)","DT Approved","2018-07-14"]
[null,null,2209,"NSW","Beverly Hills, Narwee","Apartment","Non Owner Occupied","All","Maximum LVR = 80% (including LMI capitalisation)","DT Approved","2025-09-02"]
[null,null,2210,"NSW","Lugarno, Peakhurst, Peakhurst Heights, Riverwood","Apartment","Non Owner Occupied","All","Maximum LVR = 80% (including LMI capitalisation)","DT Approved","2025-09-02"]
[null,null,2211,"NSW","Padstow, Padstow Heights","Apartment","All","All","Maximum LVR = 80% (including LMI capitalisation)","DT Approved","2025-09-02"]
[null,null,2212,"NSW","Revesby, Revesby Heights","Apartment","All","All","Maximum LVR = 80% (including LMI capitalisation)","DT Approved","2025-09-02"]
[null,null,2213,"NSW","East Hills, Panania, Picnic Point","Apartment","All","All","Maximum LVR = 80% (including LMI capitalisation)","DT Approved","2025-09-02"]
[null,null,2216,"NSW","Banksia, Brighton-Le-Sands, Kyeemagh, Rockdale","Apartment","All","All","Maximum LVR = 80% (including LMI capitalisation)","DT Approved","2023-07-20"]
[null,null,2217,"NSW","Beverley Park, Kogarah, Kogarah Bay, Monterey, Ramsgate, Ramsgate Beach","Apartment","All","All","Maximum LVR = 80% (including LMI capitalisation)","DT Approved","2023-07-20"]
{"$rows_left_out":284}
{"sheet":"Definitions","index":4,"n_rows":14,"n_cols":4,"rows_kept":14,"cut":false,"hidden":true,"merged":[]}
[]
[null,null,"Geographic Strategies Postcode Reference Tool"]
[]
[]
[]
[null,null,"Field","Definition"]
[null,null,"Postcode","Postcode in which the security is located"]
[null,null,"State","State in which the security is located (driven by Postcode in which the security is located)."]
[null,null,"Suburb","Suburb in which the security is located (suburbs provided are a guide only and are not exhaustive of all towns associated with each postcode)."]
[null,null,"Property Type","Property Type to which the policy/strategy applies (note: an apartment is not a detached house, townhouse or multi-unit property type)."]
[null,null,"Loan Purpose","Loan Purpose to which the policy/strategy applies."]
[null,null,"Loan Type","Loan Type to which policy/strategy applies (Principal and Interest, Interest Only)."]
[null,null,"Policy","Applicable restrictions."]
[null,null,"Effective Date","Applications received on or after this date shall have the listed policy/strategy applied."]